{"text_format":"3","workbook":"xlsx","n_sheets":3,"sheets":["説明","申込書","登録"],"not_rendered":{"images":4,"macros":1,"defined_names":4,"comments":2},"read":"whole","date_system":"1900"}

{"sheet":"説明","index":0,"n_rows":80,"n_cols":6,"rows_kept":80}
[null,"佐賀県中学校　新人陸上競技大会　申込一覧表　申込データ"]
[]
[null,"入力のしかた",null,"※入力前に必ず読んでください。"]
[{"$nulls":3},"このシートを印刷して，確認しながら入力してください。"]
[{"$nulls":3},"※申込書のシートを表示するボタンは，説明の下にあります。"]
["１）全般"]
[null,"・背景が白いセルだけ入力できます。（色つきの部分は入力できません。）"]
[null,"・行・列の削除・挿入，セルのコピー・貼り付けを絶対にしないでください。"]
[null,"※禁止された操作によりデータに不具合を生じた場合は，責任を負いかねます。"]
["２）所属名・監督名・住所・電話"]
[null,"・最初の競技者のアスリートビブスを入力すると，略称が自動的に入力されます。"]
[null,"　但し、登録シートの自分の学校のセルに入力しておく必要があります！"]
[null,"・監督名，住所（学校所在地），電話番号は直接入力してください。"]
[null,"・電話番号は，休日も連絡可能な番号（監督の携帯等）にしてください。"]
["３）性別・アスリートビブス・競技者名・学年"]
[null,"・性別はセル右側の▼をクリックして男女どちらかを選んでください。"]
[null,"※性別が空欄のまま他の欄を入力してもデータが有効になりません。"]
[null,"・アスリートビブスは，新年度用を使用してください。"]
[null,"・ナンバー欄に登録番号を入力すると，競技者名，学年が自動的に入ります。"]
[null,"・氏名が異なる場合は，登録データをご確認ください。"]
["４）申込種目"]
[null,"・申込種目欄（セル）右側の▼をクリックして種目リストを表示させ，種目を選択します。"]
["５）記録"]
[null,"・ここで入力された記録は，番組編成の参考とします。"]
[null,"・次のような入力規則でお願いします。（数字，小数点以外は入力できません。）"]
[null,"　短距離：   12秒34　→　12.34　※１分を超える場合：1分01秒23　→　61.23"]
[null,"　長距離：2分34秒56　→　234.56（表示は 2:34.56 になります。）"]
[null,"　フィールド： 5m43　→　5.43"]
[null,"・原則として，過去１年以内の公認記録を入力してください。"]
[null,"・公認記録がない場合，記録欄は空欄で構いません。練習時の記録を入れたい場合は，"]
[null,"　次のように換算して入力してください。（公認記録優先のため）"]
[null,"　短距離：小数以下切り上げ・・・・・13秒1　→　14秒0"]
[null,"　長距離：10秒以下切り上げ・・・・5分41秒　→　5分50秒"]
[null,"　フィールド：10cm以下切り捨て・・・4ｍ39　→　4ｍ30"]
["６）リレー"]
[null,"・リレーメンバーは，リレー申込欄（K列とL列）で▼をクリックして，○またはＡ～"]
[null,"　Ｆを選びます。（１チームだけのときは○，２チーム以上の場合はＡ～Ｆ）"]
[null,"・リレーの記録は，個人種目の記録と同じ要領で入力します。"]
["７）入力時の注意事項（必ず守っていただきたいこと）"]
[null,"　　①本大会に出場の場合には佐賀陸協、佐賀県中体連または佐賀県高体連への登録が必要となります。"]
[null,"　　　※選手番号をもらうこと"]
[null,"　　②登録番号にアルファベット（例：A-123）は使用できません。"]
[null,null,"→　１２３"]
[null,"　　③背景が白いセルだけ入力できます。"]
[null,"　　　※色つきの部分は入力できません。"]
[null,"　　④行・列の削除・挿入，セルのコピー・貼り付けを絶対にしないで下さい。"]
[null,"　　　※禁止された操作によりデータに不具合を生じた場合は，責任を負いかねます。"]
["８）申込書の印刷・郵送・参加料の送金"]
[null,"・申込書シートの上部にある［印刷］ボタンを左クリックし，印刷してください。"]
[null,"・日付と代表者名を入力（手書き，ゴム印も可）し，捺印して郵送(PDF送信可）してください。"]
[null,"・参加料は申込と同時にお支払いください。"]
[]
["９）申込データの送信"]
[]
[null,"・申込書シート上部の［送信用データ作成］ボタンを左クリックします。"]
[null,"・送信用ファイルが作成されます。"]
[null,"・送信用ファイルは，所属略称・区分名（中）からなるCSVファイルです。"]
[null,"　例：青嶺中学校の場合：青嶺・中.CSV"]
[null,"（画面にもファイル名が表示されますので，必ずご確認ください。）"]
[null,"・送信用ファイルをメールに添付して，下のアドレスへ送信します。"]
[null,null,"sagachuriku@yahoo.co.jp",null,null,"(佐賀県中体連専門委員　：力久）"]
[null,"※EXCELﾌｧｲﾙではなく、ﾎﾞﾀﾝをｸﾘｯｸして作成したCSVﾌｧｲﾙを添付します。"]
[null,"※印刷した申込書とCSVﾌｧｲﾙの選手や種目が一致しているか確認して。"]
[null,"　送信してください。"]
[]
[]
["※ボタンをクリックしても変化がない場合は，マクロが無効になっています。"]
["下の説明を読んで，対処してください。"]
[]
["マクロが無効になる原因"]
["１）ＥＸＣＥＬのセキュリティレベルが「高」になっている。"]
[null,"解決方法"]
[null,"ＥＸＣＥＬ上部のメニューから，「ツール(T)」－「マクロ(M)」－「セキュリティ(S)」"]
[null,"の順にメニューを開き，「セキュリティレベル」を開きます。"]
[null,"「セキュリティレベル」の設定を「中」にしてください。"]
[]
["２）ファイルを開くとき「マクロを無効にする」を選んだ。"]
[null,"解決方法"]
[null,"ファイルを開くとき，マクロウイルスに関する警告画面が表示されます。"]
[null,"このとき「マクロを有効にする」を選択します。"]

{"sheet":"申込書","index":1,"n_rows":133,"n_cols":23,"rows_kept":133,"hidden":true,"merged":[[0,3,0,8],[1,0,1,12],[2,0,2,1],[2,3,2,4],[2,6,3,7],[2,8,3,8],[2,9,3,13],[3,0,3,1],[3,3,3,4],[4,0,4,1],[4,2,4,5],[4,6,4,7],[4,9,4,13],[5,0,5,1],[5,2,5,3],[5,4,5,5],[5,6,5,8],[5,9,5,13],[6,0,7,0],[6,2,7,2],[6,3,6,4],[6,5,7,5],[6,6,7,6],[6,7,7,7],[7,3,7,4],[8,0,9,0],[8,1,9,1],[8,2,9,2],[8,5,9,5],[8,6,9,6],[8,7,9,7],[10,0,11,0],[10,1,11,1],[10,2,11,2],[10,5,11,5],[10,6,11,6],[10,7,11,7],[12,0,13,0],[12,1,13,1],[12,2,13,2],[12,5,13,5],[12,6,13,6],[12,7,13,7],[14,0,15,0],[14,1,15,1],[14,2,15,2],[14,5,15,5],[14,6,15,6],[14,7,15,7],[16,0,17,0],[16,1,17,1],[16,2,17,2],[16,5,17,5],[16,6,17,6],[16,7,17,7],[18,0,19,0],[18,1,19,1],[18,2,19,2],[18,5,19,5],[18,6,19,6],[18,7,19,7],[20,0,21,0],[20,1,21,1],[20,2,21,2],[20,5,21,5],[20,6,21,6],[20,7,21,7],[22,0,23,0],[22,1,23,1],[22,2,23,2],[22,5,23,5],[22,6,23,6],[22,7,23,7],[24,0,25,0],[24,1,25,1],[24,2,25,2],[24,5,25,5],[24,6,25,6],[24,7,25,7],[26,0,27,0],[26,1,27,1],[26,2,27,2],[26,5,27,5],[26,6,27,6],[26,7,27,7],[28,0,29,0],[28,1,29,1],[28,2,29,2],[28,5,29,5],[28,6,29,6],[28,7,29,7],[30,0,31,0],[30,1,31,1],[30,2,31,2],[30,5,31,5],[30,6,31,6],[30,7,31,7],[32,0,33,0],[32,1,33,1],[32,2,33,2],[32,5,33,5],[32,6,33,6],[32,7,33,7],[34,0,35,0],[34,1,35,1],[34,2,35,2],[34,5,35,5],[34,6,35,6],[34,7,35,7],[36,0,37,0],[36,1,37,1],[36,2,37,2],[36,5,37,5],[36,6,37,6],[36,7,37,7],[38,0,38,11],[39,0,39,11],[40,0,42,0],[40,1,40,2],[40,4,40,6],[40,9,40,10],[41,1,41,2],[41,4,42,6],[41,8,41,13],[42,1,42,2],[42,9,42,10],[44,0,45,0],[44,1,45,1],[44,2,45,2],[44,5,45,5],[44,6,45,6],[44,7,45,7],[46,0,47,0],[46,1,47,1],[46,2,47,2],[46,5,47,5],[46,6,47,6],[46,7,47,7],[48,0,49,0],[48,1,49,1],[48,2,49,2],[48,5,49,5],[48,6,49,6],[48,7,49,7],[50,0,51,0],[50,1,51,1],[50,2,51,2],[50,5,51,5],[50,6,51,6],[50,7,51,7],[52,0,53,0],[52,1,53,1],[52,2,53,2],[52,5,53,5],[52,6,53,6],[52,7,53,7],[54,0,55,0],[54,1,55,1],[54,2,55,2],[54,5,55,5],[54,6,55,6],[54,7,55,7],[56,0,57,0],[56,1,57,1],[56,2,57,2],[56,5,57,5],[56,6,57,6],[56,7,57,7],[58,0,59,0],[58,1,59,1],[58,2,59,2],[58,5,59,5],[58,6,59,6],[58,7,59,7],[60,0,61,0],[60,1,61,1],[60,2,61,2],[60,5,61,5],[60,6,61,6],[60,7,61,7],[62,0,63,0],[62,1,63,1],[62,2,63,2],[62,5,63,5],[62,6,63,6],[62,7,63,7],[64,0,65,0],[64,1,65,1],[64,2,65,2],[64,5,65,5],[64,6,65,6],[64,7,65,7],[66,0,67,0],[66,1,67,1],[66,2,67,2],[66,5,67,5],[66,6,67,6],[66,7,67,7],[68,0,69,0],[68,1,69,1],[68,2,69,2],[68,5,69,5],[68,6,69,6],[68,7,69,7],[70,0,71,0],[70,1,71,1],[70,2,71,2],[70,5,71,5],[70,6,71,6],[70,7,71,7],[72,0,73,0],[72,1,73,1],[72,2,73,2],[72,5,73,5],[72,6,73,6],[72,7,73,7],[74,0,75,0],[74,1,75,1],[74,2,75,2],[74,5,75,5],[74,6,75,6],[74,7,75,7],[76,0,77,0],[76,1,77,1],[76,2,77,2],[76,5,77,5],[76,6,77,6],[76,7,77,7],[78,0,79,0],[78,1,79,1],[78,2,79,2],[78,5,79,5],[78,6,79,6],[78,7,79,7],[80,0,81,0],[80,1,81,1],[80,2,81,2],[80,5,81,5],[80,6,81,6],[80,7,81,7],[82,0,83,0],[82,1,83,1],[82,2,83,2],[82,5,83,5],[82,6,83,6],[82,7,83,7],[84,0,85,0],[84,1,85,1],[84,2,85,2],[84,5,85,5],[84,6,85,6],[84,7,85,7],[86,0,87,0],[86,1,87,1],[86,2,87,2],[86,5,87,5],[86,6,87,6],[86,7,87,7],[88,0,89,0],[88,1,89,1],[88,2,89,2],[88,5,89,5],[88,6,89,6],[88,7,89,7],[90,0,91,0],[90,1,91,1],[90,2,91,2],[90,5,91,5],[90,6,91,6],[90,7,91,7],[92,0,93,0],[92,1,93,1],[92,2,93,2],[92,5,93,5],[92,6,93,6],[92,7,93,7],[94,0,95,0],[94,1,95,1],[94,2,95,2],[94,5,95,5],[94,6,95,6],[94,7,95,7],[96,0,97,0],[96,1,97,1],[96,2,97,2],[96,5,97,5],[96,6,97,6],[96,7,97,7],[98,0,99,0],[98,1,99,1],[98,2,99,2],[98,5,99,5],[98,6,99,6],[98,7,99,7],[100,0,101,0],[100,1,101,1],[100,2,101,2],[100,5,101,5],[100,6,101,6],[100,7,101,7],[102,0,103,0],[102,1,103,1],[102,2,103,2],[102,5,103,5],[102,6,103,6],[102,7,103,7],[104,0,105,0],[104,1,105,1],[104,2,105,2],[104,5,105,5],[104,6,105,6],[104,7,105,7],[106,0,107,0],[106,1,107,1],[106,2,107,2],[106,5,107,5],[106,6,107,6],[106,7,107,7],[108,0,109,0],[108,1,109,1],[108,2,109,2],[108,5,109,5],[108,6,109,6],[108,7,109,7],[110,0,111,0],[110,1,111,1],[110,2,111,2],[110,5,111,5],[110,6,111,6],[110,7,111,7],[112,0,113,0],[112,1,113,1],[112,2,113,2],[112,5,113,5],[112,6,113,6],[112,7,113,7],[114,0,115,0],[114,1,115,1],[114,2,115,2],[114,5,115,5],[114,6,115,6],[114,7,115,7],[116,0,117,0],[116,1,117,1],[116,2,117,2],[116,5,117,5],[116,6,117,6],[116,7,117,7],[118,0,119,0],[118,1,119,1],[118,2,119,2],[118,5,119,5],[118,6,119,6],[118,7,119,7],[120,0,121,0],[120,1,121,1],[120,2,121,2],[120,5,121,5],[120,6,121,6],[120,7,121,7],[122,0,123,0],[122,1,123,1],[122,2,123,2],[122,5,123,5],[122,6,123,6],[122,7,123,7],[124,0,125,0],[124,1,125,1],[124,2,125,2],[124,5,125,5],[124,6,125,6],[124,7,125,7],[126,0,127,0],[126,1,127,1],[126,2,127,2],[126,5,127,5],[126,6,127,6],[126,7,127,7],[128,0,129,0],[128,1,129,1],[128,2,129,2],[128,5,129,5],[128,6,129,6],[128,7,129,7],[130,0,131,0],[130,1,131,1],[130,2,131,2],[130,5,131,5],[130,6,131,6],[130,7,131,7],[132,0,133,0],[132,1,133,1],[132,2,133,2],[132,5,133,5],[132,6,133,6],[132,7,133,7]]}
[{"$nulls":3},"≪男女兼用入力≫\n(男 ⇒ 女 出場者全員の順)",{"$nulls":10},"個人",null,"男100m",null,"男A",{"$f":"IF((COUNTIF(L$9:L$38,$S1)+COUNTIF(L$45:L$134,$S1))>=8,2,IF((COUNTIF(L$9:L$38,$S1)+COUNTIF(L$45:L$134,$S1))>=4,1,0))","v":0},0,null," 月   日"]
["　佐賀県中学新人陸上競技大会　申込一覧表",{"$nulls":13},700,null,"男150m",null,"女A",0,0,null,"2012-09-03"]
["学校名",null,"ﾌﾘｶﾞﾅ",{"$f":"VLOOKUP(C4,登録!Q1:U123,3,0)","v":"学校№を入力すると表示されます"},null,"ﾁｭｳ","住所",null,"住所",{"$f":"VLOOKUP(C4,登録!Q:U,4,0)","v":"学校№を入力すると表示されます"},{"$nulls":4},"リレー",null,"男400m",null,null,0,0,null,"2012-09-04"]
["学校№",null,99,{"$f":"VLOOKUP(C4,登録!Q1:U123,2,0)","v":"学校№を入力すると表示されます"},null,"中",{"$nulls":8},1300,null,"男800m",null,null,0,0,null,"2012-09-05"]
["監督名",{"$nulls":5},"電話",null,"監督携帯",{"$nulls":7},"男1500m",null,null,0,0,null,"2012-09-06"]
["補助員２名",{"$nulls":5},"審判員名１名",null,null,{"$f":"IF(C5=\"\",\"\",C5)","v":""},{"$nulls":6},"男110mH",null,null,0,0,null,"2012-09-07"]
[null,"男","ﾅﾝﾊﾞｰ","ﾌﾘｶﾞﾅ(半角)",null,"学年","年齢","種別","申込種目①","申込種目②","申込種目③"," 4×","申込","人",null,null,"男走高跳",null,null,0,0,null,"2012-09-08"]
[null,"女",null,"競 技 者 名",{"$nulls":4},"最高記録","最高記録","最高記録","100mR","種目","数",null,null,"男走幅跳",{"$nulls":5},"2012-09-09"]
[1,{"$nulls":5},12,"B",{"$nulls":4},"男100m",{"$f":"COUNTIF($I$9:$K$135,M9)","v":0},{"$f":"COUNTA(I9:K9)","v":0},null,"男砲丸投(5kg)",{"$nulls":5},"2012-09-10"]
[{"$nulls":12},"男150m",{"$f":"COUNTIF($I$9:$K$135,M10)","v":0},null,null,"男OP3000m"]
[2,{"$nulls":11},"男400m",{"$f":"COUNTIF($I$9:$K$135,M11)","v":0},{"$f":"COUNTA(I11:K11)","v":0},null,"男OP砲丸投(4kg)"]
[{"$nulls":12},"男800m",0,null,null,"男OPｼﾞｬﾍﾞﾘｯｸｽﾛｰ"]
[3,{"$nulls":11},"男1500m",0,{"$f":"COUNTA(I13:K13)","v":0},null,"女100m"]
[{"$nulls":12},"男110mH",0,null,null,"女150m"]
[4,{"$nulls":11},"男走高跳",0,{"$f":"COUNTA(I15:K15)","v":0},null,"女400m"]
[{"$nulls":12},"男走幅跳",0,null,null,"女800m"]
[5,{"$nulls":11},"男砲丸投(5kg)",0,{"$f":"COUNTA(I17:K17)","v":0},null,"女1500m"]
[{"$nulls":12},"男OP3000m",0,null,null,"女100mH"]
[6,{"$nulls":11},"男OP砲丸投(4kg)",0,{"$f":"COUNTA(I19:K19)","v":0},null,"女走高跳"]
[{"$nulls":12},"男OPｼﾞｬﾍﾞﾘｯｸｽﾛｰ",0,null,null,"女走幅跳"]
[7,{"$nulls":13},{"$f":"COUNTA(I21:K21)","v":0},null,"女砲丸投"]
[{"$nulls":12},"男A",{"$f":"T1","v":0},null,null,"女OP2000m"]
[8,{"$nulls":11},"女100m",{"$f":"COUNTIF($I$9:$K$135,M23)","v":0},{"$f":"COUNTA(I23:K23)","v":0},null,"女OPｼﾞｬﾍﾞﾘｯｸｽﾛｰ"]
[{"$nulls":12},"女150m",{"$f":"COUNTIF($I$9:$K$135,M24)","v":0}]
[9,{"$nulls":11},"女400m",{"$f":"COUNTIF($I$9:$K$135,M25)","v":0},{"$f":"COUNTA(I25:K25)","v":0}]
[{"$nulls":12},"女800m",0]
[10,{"$nulls":11},"女1500m",0,{"$f":"COUNTA(I27:K27)","v":0}]
[{"$nulls":12},"女100mH",0]
[11,{"$nulls":11},"女走高跳",0,{"$f":"COUNTA(I29:K29)","v":0}]
[{"$nulls":12},"女走幅跳",0]
[12,{"$nulls":11},"女砲丸投",0,{"$f":"COUNTA(I31:K31)","v":0}]
[{"$nulls":12},"女OP2000m",{"$f":"COUNTIF($I$9:$K$135,M32)","v":0}]
[13,{"$nulls":11},"女OPｼﾞｬﾍﾞﾘｯｸｽﾛｰ",{"$f":"COUNTIF($I$9:$K$135,M33)","v":0},{"$f":"COUNTA(I33:K33)","v":0}]
[]
[14,{"$nulls":11},"女A",{"$f":"T2","v":0},{"$f":"COUNTA(I35:K35)","v":0}]
[]
[15,{"$nulls":13},{"$f":"COUNTA(I37:K37)","v":0}]
[]
["※所属，氏名とも「ﾌﾘｶﾞﾅ」(半角)を必ず記入し，種目はリストから選択（正式種目２名まで）して下さい。"]
["※リレー種目欄下段の記録は代表者（１名）のみ記入し，個人種目もタイムレースには特に記入が必要です。"]
["申込料","個人種目",null,"ﾘﾚｰ種目","合計金額",{"$nulls":3},"令和５年",{"$f":"TODAY()","v":"2023-07-21"}]
[null,{"$f":"SUM(N23:N33,N9:N20)","v":0},null,{"$f":"SUM(T1:T2)","v":0},{"$f":"SUM(B43:D43)","v":0},{"$nulls":3},"本校・本チームの生徒であることを認め、大会に申し込みます。"]
[null,{"$f":"B42*O2","v":0},null,{"$f":"D42*O4","v":0},{"$nulls":4},"責任者名",null,null,"印"]
[]
[16,{"$nulls":13},{"$f":"COUNTA(I45:K45)","v":0}]
[]
[17,{"$nulls":13},{"$f":"COUNTA(I47:K47)","v":0}]
[]
[18,{"$nulls":13},{"$f":"COUNTA(I49:K49)","v":0}]
[]
[19,{"$nulls":13},{"$f":"COUNTA(I51:K51)","v":0}]
[]
[20,{"$nulls":13},{"$f":"COUNTA(I53:K53)","v":0}]
[]
[21,{"$nulls":13},{"$f":"COUNTA(I55:K55)","v":0}]
[]
[22,{"$nulls":13},{"$f":"COUNTA(I57:K57)","v":0}]
[]
[23,{"$nulls":13},{"$f":"COUNTA(I59:K59)","v":0}]
[]
[24,{"$nulls":13},{"$f":"COUNTA(I61:K61)","v":0}]
[]
[25,{"$nulls":13},{"$f":"COUNTA(I63:K63)","v":0}]
[]
[26,{"$nulls":13},{"$f":"COUNTA(I65:K65)","v":0}]
[]
[27,{"$nulls":13},{"$f":"COUNTA(I67:K67)","v":0}]
[]
[28,{"$nulls":13},{"$f":"COUNTA(I69:K69)","v":0}]
[]
[29,{"$nulls":13},{"$f":"COUNTA(I71:K71)","v":0}]
[]
[30,{"$nulls":13},{"$f":"COUNTA(I73:K73)","v":0}]
[]
[31,{"$nulls":13},{"$f":"COUNTA(I75:K75)","v":0}]
[]
[32,{"$nulls":13},{"$f":"COUNTA(I77:K77)","v":0}]
[]
[33,{"$nulls":13},{"$f":"COUNTA(I79:K79)","v":0}]
[]
[34,{"$nulls":13},{"$f":"COUNTA(I81:K81)","v":0}]
[]
[35,{"$nulls":13},{"$f":"COUNTA(I83:K83)","v":0}]
[]
[36,{"$nulls":13},{"$f":"COUNTA(I85:K85)","v":0}]
[]
[37,{"$nulls":13},{"$f":"COUNTA(I87:K87)","v":0}]
[]
[38,{"$nulls":13},{"$f":"COUNTA(I89:K89)","v":0}]
[]
[39,{"$nulls":13},{"$f":"COUNTA(I91:K91)","v":0}]
[]
[40,{"$nulls":13},{"$f":"COUNTA(I93:K93)","v":0}]
[]
[41,{"$nulls":13},{"$f":"COUNTA(I95:K95)","v":0}]
[]
[42,{"$nulls":13},{"$f":"COUNTA(I97:K97)","v":0}]
[]
[43,{"$nulls":13},{"$f":"COUNTA(I99:K99)","v":0}]
[]
[44,{"$nulls":13},{"$f":"COUNTA(I101:K101)","v":0}]
[]
[45,{"$nulls":13},{"$f":"COUNTA(I103:K103)","v":0}]
[]
[46,{"$nulls":13},{"$f":"COUNTA(I105:K105)","v":0}]
[]
[47,{"$nulls":13},{"$f":"COUNTA(I107:K107)","v":0}]
[]
[48,{"$nulls":13},{"$f":"COUNTA(I109:K109)","v":0}]
[]
[49,{"$nulls":13},{"$f":"COUNTA(I111:K111)","v":0}]
[]
[50,{"$nulls":13},{"$f":"COUNTA(I113:K113)","v":0}]
[]
[51,{"$nulls":13},{"$f":"COUNTA(I115:K115)","v":0}]
[]
[52,{"$nulls":13},{"$f":"COUNTA(I117:K117)","v":0}]
[]
[53,{"$nulls":13},{"$f":"COUNTA(I119:K119)","v":0}]
[]
[54,{"$nulls":13},{"$f":"COUNTA(I121:K121)","v":0}]
[]
[55,{"$nulls":13},{"$f":"COUNTA(I123:K123)","v":0}]
[]
[56,{"$nulls":13},{"$f":"COUNTA(I125:K125)","v":0}]
[]
[57,{"$nulls":13},{"$f":"COUNTA(I127:K127)","v":0}]
[]
[58,{"$nulls":13},{"$f":"COUNTA(I129:K129)","v":0}]
[]
[59,{"$nulls":13},{"$f":"COUNTA(I131:K131)","v":0}]
[]
[60,{"$nulls":13},{"$f":"COUNTA(I133:K133)","v":0}]

{"sheet":"登録","index":2,"n_rows":124,"n_cols":21,"rows_kept":124,"merged":[[0,0,0,6],[0,8,0,14]]}
["男子　登録シート",{"$nulls":7},"女子　登録シート",{"$nulls":7},"学校№","学校名","ﾌﾘｶﾞﾅ","住所","電話番号"]
["ﾅﾝﾊﾞｰ","所属","姓","名","ｾｲ","ﾒｲ","学年",null,"ﾅﾝﾊﾞｰ","所属","姓","名","ｾｲ","ﾒｲ","学年",null,1,"鳥栖","ﾄｽ","鳥栖市本町二丁目104-1","0942-83-2087"]
[{"$nulls":16},2,"田代","ﾀｼﾛ","鳥栖市田代外町651-1 ","0942-83-2758"]
[{"$nulls":16},3,"基里","ｷｻﾞﾄ","鳥栖市原町672-1 ","0942-83-2944"]
[{"$nulls":16},4,"鳥栖西","ﾄｽﾆｼ","鳥栖市蔵上町77-1 ","0942-83-2086"]
[{"$nulls":16},5,"香楠","ｺｳﾅﾝ","鳥栖市古野町600番地１ ","0942-83-2211"]
[{"$nulls":16},6,"基山","ｷﾔﾏ","三養基郡基山町大字宮浦941","0942-92-2203"]
[{"$nulls":16},7,"北茂安","ｷﾀｼｹﾞﾔｽ","三養基郡みやき町大字東尾4435 ","0942-89-2008"]
[{"$nulls":16},8,"上峰","ｶﾐﾐﾈ","三養基郡上峰町大字坊所2659","0952-52-3834"]
[{"$nulls":16},9,"神埼","ｶﾝｻﾞｷ","神埼市神埼町鶴3565 ","0952-52-3175"]
[{"$nulls":16},10,"三田川","ﾐﾀｶﾞﾜ","神埼郡吉野ヶ里町吉田303 ","0952-52-2195"]
[{"$nulls":16},11,"千代田","ﾁﾖﾀﾞ","千代田町大字直鳥929-1","0952-44-2222"]
[{"$nulls":16},12,"脊振","ｾﾌﾘ","神埼市脊振町大字広滝594-1","0952-59-2221"]
[{"$nulls":16},13,"東脊振","ﾋｶﾞｼｾﾌﾘ","神埼郡吉野ヶ里町石動2709 ","0952-52-2529"]
[{"$nulls":16},14,"中原","ﾅｶﾊﾞﾙ","みやき町大字蓑原1475番地9 ","0942-94-2038"]
[{"$nulls":16},15,"三根","ﾐﾈ","三養基郡みやき町大字市武1661 ","0942-96-2229"]
[{"$nulls":16},16,"東明館","ﾄｳﾒｲｶﾝ","三養基郡基山町大字宮浦683 ","0942-92-5775"]
[{"$nulls":16},17,"成章","ｾｲｼｮｳ","佐賀市成章町7-1 ","0952-24-4265"]
[{"$nulls":16},18,"城南","ｼﾞｮｳﾅﾝ","佐賀市南佐賀一丁目20-1 ","0952-24-4338"]
[{"$nulls":16},19,"昭栄","ｼｮｳｴｲ","佐賀市昭栄町1-7 ","0952-24-4238"]
[{"$nulls":16},20,"城東","ｼﾞｮｳﾄｳ","佐賀市巨勢町大字牛島242 ","0952-24-4286"]
[{"$nulls":16},21,"城西","ｼﾞｮｳｻｲ","佐賀市本庄町大字本庄1021-1","0952-24-9220"]
[{"$nulls":16},22,"城北","ｼﾞｮｳﾎｸ","佐賀市高木瀬西三丁目1-50","0952-30-9258"]
[{"$nulls":16},23,"金泉","ｷﾝｾﾝ","佐賀市久保泉町大字上和泉2361-1","0952-98-1181"]
[{"$nulls":16},24,"鍋島","ﾅﾍﾞｼﾏ","佐賀市鍋島一丁目19-1","0952-30-5811"]
[{"$nulls":16},25,"大和","ﾔﾏﾄ","佐賀市大和町大字東山田3554-1","0952-62-1315"]
[{"$nulls":16},26,"川副","ｶﾜｿｴ","佐賀市川副町大字鹿江710 ","0952-45-1251"]
[{"$nulls":16},27,"東与賀","ﾋｶﾞｼﾖｶ","佐賀市東与賀町大字下古賀1127-1 ","0952-45-0376"]
[{"$nulls":16},28,"思斉館","ｼｾｲｶﾝ","佐賀市久保田町大字新田1217 ","0952-68-2161"]
[{"$nulls":16},29,"致遠館","ﾁｴﾝｶﾝ","佐賀市兵庫町大字藤木1092-1 ","0952-33-0401"]
[{"$nulls":16},30,"附属","ﾌｿﾞｸ","佐賀市城内1丁目14番4号",""]
[{"$nulls":16},31,"芙蓉","ﾌﾖｳ","佐賀市蓮池町大字小松1005-1","0952-97-1171"]
[{"$nulls":16},32,"諸富","ﾓﾛﾄﾞﾐ","佐賀市諸富町大字徳富2058-3 ","0952-47-2331"]
[{"$nulls":16},33,"松梅","ﾏﾂｳﾒ","佐賀市大和町大字松瀬2090-1 ","0952-63-0812"]
[{"$nulls":16},34,"富士","ﾌｼﾞ","佐賀市富士町大字古湯2735 ","0952-58-2201"]
[{"$nulls":16},35,"北山","ﾎｸｻﾞﾝ","佐賀市富士町大字中原342-2 ","0952-57-2211"]
[{"$nulls":16},36,"三瀬","ﾐﾂｾ","佐賀市三瀬村三瀬2789 ","0952-56-2106"]
[{"$nulls":16},37,"弘学館","ｺｳｶﾞｯｶﾝ","佐賀市金立町大字金立1544-1 ","0952-98-2161"]
[{"$nulls":16},38,"佐賀清和","ｻｶﾞｾｲﾜ","佐賀市与賀町78 ","0952-24-5291"]
[{"$nulls":16},39,"成穎","ｾｲｴｲ","佐賀市駅前中央2-9-10 ","0952-31-5401"]
[{"$nulls":16},40,"龍谷","ﾘｭｳｺｸ","佐賀市水ヶ江3-1-25 ","0952-24-2244"]
[{"$nulls":16},41,"小城","ｵｷﾞ","小城市小城町松尾4104","0952-73-2191"]
[{"$nulls":16},42,"芦刈観瀾","ｱｼｶﾘｶﾝﾗﾝ","小城市芦刈町三王崎１４","0952-66-0403"]
[{"$nulls":16},43,"牛津","ｳｼﾂﾞ","小城市牛津町牛津549 ","0952-66-0022"]
[{"$nulls":16},44,"三日月","ﾐｶﾂﾞｷ","小城市三日月町長神田1650 ","0952-73-2016"]
[{"$nulls":16},45,"東原庠舎中央校","ﾄｳｹﾞﾝｼｮｳｼｬﾁｭｳｵｳｺｳ","多久市南多久町大字下多久2286-13 ","0952-74-3971"]
[{"$nulls":16},46,"東原庠舎西渓校","ﾄｳｹﾞﾝｼｮｳｼｬｾｲｹｲｺｳ","多久市多久町1784-1 ","0952-75-2827"]
[{"$nulls":16},47,"東原庠舎東部校","ﾄｳｹﾞﾝｼｮｳｼｬﾄｳﾌﾞｺｳ","多久市東多久町大字別府3182 ","0952-76-2007"]
[{"$nulls":16},48,"唐津一","ｶﾗﾂｲﾁ","唐津市町田一丁目4-1","0955-73-2815"]
[{"$nulls":16},49,"唐津五","ｶﾗﾂｺﾞ","唐津市和多田用尺1-1 ","0955-72-2134"]
[{"$nulls":16},50,"鏡","ｶｶﾞﾐ","唐津市鏡1136 ","0955-77-0500"]
[{"$nulls":16},51,"鬼塚","ｵﾆﾂﾞｶ","唐津市山本1916 ","0955-78-0135"]
[{"$nulls":16},52,"西唐津","ﾆｼｶﾗﾂ","唐津市二タ子一丁目7-83 ","0955-74-8651"]
[{"$nulls":16},53,"唐津東","ｶﾗﾂﾋｶﾞｼ","唐津市鏡新開１番地","0955-77-1984"]
[{"$nulls":16},54,"湊","ﾐﾅﾄ","唐津市湊町594 ","0955-79-0009"]
[{"$nulls":16},55,"北波多","ｷﾀﾊﾀ","唐津市北波多徳須恵303","0955-64-2009"]
[{"$nulls":16},56,"佐志","ｻｼ","唐津市中瀬通1-3","0955-73-3361"]
[{"$nulls":16},57,"高峰","ｺｳﾎｳ","唐津市竹木場５５７６番地１７","0955-53-2220"]
[{"$nulls":16},58,"肥前","ﾋｾﾞﾝ","唐津市肥前町入野甲2217-2","0955-54-1105"]
[{"$nulls":16},59,"海青","ｶｲｾｲ","唐津市鎮西町横竹838-9","0955-82-3957"]
[{"$nulls":16},60,"玄海みらい学園","ｹﾞﾝｶｲ","松浦郡玄海町大字新田1809-6","0955-80-0234"]
[{"$nulls":16},61,"相知","ｵｳﾁ","唐津市相知町相知2482","0955-62-2814"]
[{"$nulls":16},62,"浜玉","ﾊﾏﾀﾏ","唐津市浜玉町大江6-1","0955-56-6650"]
[{"$nulls":16},63,"虹松","ﾆｽﾞﾏﾂ","唐津市浜玉町浜崎2137","0955-56-6654"]
[{"$nulls":16},64,"七山","ﾅﾅﾔﾏ","唐津市七山藤川2263","0955-58-2041"]
[{"$nulls":16},65,"厳木","ｷｭｳﾗｷﾞ","唐津市厳木町牧瀬328-1","0955-63-2531"]
[{"$nulls":16},66]
[{"$nulls":16},67,"早稲田佐賀","ﾜｾﾀﾞｻｶﾞ","唐津市東城内7番1号",""]
[{"$nulls":16},68,"伊万里","ｲﾏﾘ","伊万里市立花町4063-1","0955-23-4158"]
[{"$nulls":16},69,"啓成","ｹｲｾｲ","伊万里市木須町131","0955-22-3600"]
[{"$nulls":16},70,"青嶺","ｾｲﾚｲ","伊万里市黒川町福田66","0955-27-0053"]
[{"$nulls":16},71,"東陵","ﾄｳﾘｮｳ","伊万里市松浦町提川200","0955-26-2012"]
[{"$nulls":16},72,"国見","ｸﾆﾐ","伊万里市東山代町長浜1750","0955-23-5195"]
[{"$nulls":16},73,"山代","ﾔﾏｼﾛ","伊万里市山代町久原3080-1","0955-28-2026"]
[{"$nulls":16},74,"滝野","ﾀｷﾉ","伊万里市東山代町滝川内3149","0955-28-0125"]
[{"$nulls":16},75,"南波多郷学館","ﾐﾅﾐﾊﾀ","伊万里市南波多町井手野2900","0955-24-2008"]
[{"$nulls":16},76,"西有田","ﾆｼｱﾘﾀ","西松浦郡有田町立部甲74","0955-46-4171"]
[{"$nulls":16},77,"有田","ｱﾘﾀ","西松浦郡有田町岩谷川内3-6-1","0955-43-2291"]
[{"$nulls":16},78,"武雄","ﾀｶｵ","武雄市武雄町大字富岡11606","0954-22-4105"]
[{"$nulls":16},79,"川登","ｶﾜﾉﾎﾞﾘ","武雄市東川登町大字袴野16082","0954-28-2001"]
[{"$nulls":16},80,"武雄北","ﾀｶｵｷﾀ","武雄市武内町大字真手野25956-3","0954-27-2004"]
[{"$nulls":16},81,"武雄青陵","ﾀｹｵｾｲﾘｮｳ","武雄市武雄町大字永島13233番地2","0954-22-3177"]
[{"$nulls":16},82,"山内","ﾔﾏｳﾁ","武雄市山内町大字三間坂甲14209","0954-45-3555"]
[{"$nulls":16},83,"北方","ｷﾀｶﾀ","武雄市北方町大字志久2384-2","0954-36-2069"]
[{"$nulls":16},84,"大町ひじり学園","ｵｵﾏﾁ","杵島郡大町町大字大町5427","0952-82-3341"]
[{"$nulls":16},85,"江北","ｺｳﾎｸ","杵島郡江北町大字山口412","0952-86-2241"]
[{"$nulls":16},86,"白石","ｼﾛｲｼ","杵島郡白石町大字遠ノ江143-1","0952-84-2411"]
[{"$nulls":16},87,"福富","ﾌｸﾄﾞﾐ","杵島郡白石町大字福富3499","0952-87-3531"]
[{"$nulls":16},88,"有明","ｱﾘｱｹ","杵島郡白石町大字坂田290-1","0954-65-2127"]
[{"$nulls":16},89,"西部","ｾｲﾌﾞ","鹿島市大字納富分1435","0954-62-1213"]
[{"$nulls":16},90,"塩田","ｼｵﾀ","嬉野市塩田町大字馬場下甲1801","0954-66-2139"]
[{"$nulls":16},91,"嬉野","ｳﾚｼﾉ","嬉野市嬉野町大字下宿甲2786","0954-43-0244"]
[{"$nulls":16},92,"東部","ﾄｳﾌﾞ","鹿島市浜町甲4020","0954-63-5246"]
[{"$nulls":16},93,"多良","ﾀﾗ","藤津郡太良町大字多良1284","0954-67-0222"]
[{"$nulls":16},94,"大野原","ｵｵﾉﾊﾗ","嬉野市嬉野町大字岩屋川内丙720","0954-43-0807"]
[{"$nulls":16},95,"吉田","ﾖｼﾀﾞ","嬉野市嬉野町大字吉田丙3016","0954-43-9321"]
[{"$nulls":16},96,"大浦","ｵｵｳﾗ","藤津郡太良町大字大浦丙1373","0954-68-2029"]
[{"$nulls":16},97,"IJAC"]
[{"$nulls":16},98,"学校№を入力すると表示されます","学校№を入力すると表示されます","学校№を入力すると表示されます","学校№を入力すると表示されます"]
[{"$nulls":16},99,"学校№を入力すると表示されます","学校№を入力すると表示されます","学校№を入力すると表示されます","学校№を入力すると表示されます"]
[{"$nulls":16},100,"アスリートリンク"]
[{"$nulls":16},101,"ﾗﾝﾗﾝﾗﾝ佐賀"]
[{"$nulls":16},102,"東与賀陸上"]
[{"$nulls":16},103,"思斉陸上"]
[{"$nulls":16},104,"小城市芦刈むつごろう走友会"]
[{"$nulls":16},105,"OGIAC"]
[{"$nulls":16},106,"多久RC"]
[{"$nulls":16},107,"肥前陸上"]
[{"$nulls":16},108,"七山少年陸上クラブ"]
[{"$nulls":16},109,"相知ランニングクラブ"]
[{"$nulls":16},110,"山代ジュニアアスリートクラブ"]
[{"$nulls":16},111,"西有田陸上クラブ"]
[{"$nulls":16},112,"伊万里三香"]
[{"$nulls":16},113,"TEAMRISING"]
[{"$nulls":16},114]
[{"$nulls":16},115]
[{"$nulls":16},116]
[{"$nulls":16},117]
[{"$nulls":16},118]
[{"$nulls":16},119]
[{"$nulls":16},120]
[{"$nulls":16},121]
[{"$nulls":16},122]
[{"$nulls":16},123]